Reaction Details
TargetProthrombin
LigandBDBM17283
Substrate/Competitorn/a
Meas. Tech.ChEMBL_516021 (CHEMBL981510)
Ki>2000000±n/a nM
Citation Nagata, TYoshino, THaginoya, NYoshikawa, KNagamochi, MKobayashi, SKomoriya, SYokomizo, AMuto, RYamaguchi, MOsanai, KSuzuki, MKanno, H Discovery of N-[(1R,2S,5S)-2-{[(5-chloroindol-2-yl)carbonyl]amino}-5-(dimethylcarbamoyl)cyclohexyl]-5-methyl-4,5,6,7-tetrahydrothiazolo[5,4-c]pyridine-2-carboxamide hydrochloride: a novel, potent and orally active direct inhibitor of factor Xa. Bioorg Med Chem17:1193-206 (2009) 
 
Prothrombin
Name:Prothrombin
Type:Protein
Mol. Mass.:70029.57
Organism:Homo sapiens (Human)
Description:P00734
Residue:622
BDBM17283
NameBDBM17283
Synonyms:(2S)-3-(7-carbamimidoylnaphthalen-2-yl)-2-(4-{[(3S)-1-ethanimidoylpyrrolidin-3-yl]oxy}phenyl)propanoic acid DX-9065a
TypeSmall organic molecule
Emp. Form.C26H28N4O3
Mol. Mass.444.5255
SMILESCC(=N)N1CC[C@@H](C1)Oc1ccc(cc1)[C@H](Cc1ccc2ccc(cc2c1)C(N)=N)C(O)=O