Reaction Details
TargetCoagulation factor X
LigandBDBM50255577
Substrate/Competitorn/a
Meas. Tech.ChEMBL_516012 (CHEMBL981501)
IC50 2.2±n/a nM
Citation Nagata, TYoshino, THaginoya, NYoshikawa, KNagamochi, MKobayashi, SKomoriya, SYokomizo, AMuto, RYamaguchi, MOsanai, KSuzuki, MKanno, H Discovery of N-[(1R,2S,5S)-2-{[(5-chloroindol-2-yl)carbonyl]amino}-5-(dimethylcarbamoyl)cyclohexyl]-5-methyl-4,5,6,7-tetrahydrothiazolo[5,4-c]pyridine-2-carboxamide hydrochloride: a novel, potent and orally active direct inhibitor of factor Xa. Bioorg Med Chem17:1193-206 (2009) 
 
Coagulation factor X
Name:Coagulation factor X
Type:Enzyme
Mol. Mass.:54726.60
Organism:Homo sapiens (Human)
Description:n/a
Residue:488
BDBM50255577
NameBDBM50255577
Synonyms:CHEMBL473243 | N-{(1R,2S,5S)-2-{[(5-Chloroindol-2-yl)carbonyl]amino}-5-[(2-methoxyethyl)(methyl)carbamoyl]cyclohexyl}-5-methyl-4,5,6,7-tetrahydrothiazolo[5,4-c]pyridine-2-carboxamide
TypeSmall organic molecule
Emp. Form.C28H35ClN6O4S
Mol. Mass.587.133
SMILESCOCCN(C)C(=O)[C@H]1CC[C@H](NC(=O)c2cc3cc(Cl)ccc3[nH]2)[C@@H](C1)NC(=O)c1nc2CCN(C)Cc2s1