Reaction Details
TargetCoagulation factor X
LigandBDBM50255205
Substrate/Competitorn/a
Meas. Tech.ChEMBL_516012 (CHEMBL981501)
IC50 2.3±n/a nM
Citation Nagata, TYoshino, THaginoya, NYoshikawa, KNagamochi, MKobayashi, SKomoriya, SYokomizo, AMuto, RYamaguchi, MOsanai, KSuzuki, MKanno, H Discovery of N-[(1R,2S,5S)-2-{[(5-chloroindol-2-yl)carbonyl]amino}-5-(dimethylcarbamoyl)cyclohexyl]-5-methyl-4,5,6,7-tetrahydrothiazolo[5,4-c]pyridine-2-carboxamide hydrochloride: a novel, potent and orally active direct inhibitor of factor Xa. Bioorg Med Chem17:1193-206 (2009) 
 
Coagulation factor X
Name:Coagulation factor X
Type:Enzyme
Mol. Mass.:54726.60
Organism:Homo sapiens (Human)
Description:n/a
Residue:488
BDBM50255205
NameBDBM50255205
Synonyms:CHEMBL508906 | N-[(1R,2S,5S)-2-{[(5-Chloroindol-2-yl)carbonyl]amino}-5-(dipropylcarbamoyl)cyclohexyl]-5-methyl-4,5,6,7-tetrahydrothiazolo[5,4-c]pyridine-2-carboxamide
TypeSmall organic molecule
Emp. Form.C30H39ClN6O3S
Mol. Mass.599.187
SMILESCCCN(CCC)C(=O)[C@H]1CC[C@H](NC(=O)c2cc3cc(Cl)ccc3[nH]2)[C@@H](C1)NC(=O)c1nc2CCN(C)Cc2s1