Reaction Details
TargetC-C chemokine receptor type 2
LigandBDBM50255219
Substrate/Competitorn/a
Meas. Tech.ChEMBL_516084 (CHEMBL982454)
IC50 2±n/a nM
Citation Cherney, RJBrogan, JBMo, RLo, YCYang, GMiller, PBScherle, PAMolino, BFCarter, PHDecicco, CP Discovery of trisubstituted cyclohexanes as potent CC chemokine receptor 2 (CCR2) antagonists. Bioorg Med Chem Lett19:597-601 (2009) 
 
C-C chemokine receptor type 2
Name:C-C chemokine receptor type 2
Type:Enzyme
Mol. Mass.:41932.32
Organism:Homo sapiens (Human)
Description:P41597
Residue:374
BDBM50255219
NameBDBM50255219
Synonyms:(+/-)-benzyl-3-(4-(methylthio)benzamido)-4-(2-(3-(trifluoromethyl)benzamido)acetamido)cyclohexylcarbamate CHEMBL505722
TypeSmall organic molecule
Emp. Form.C32H33F3N4O5S
Mol. Mass.642.688
SMILESCSc1ccc(cc1)C(=O)NC1CC(CCC1NC(=O)CNC(=O)c1cccc(c1)C(F)(F)F)NC(=O)OCc1ccccc1