Reaction Details
TargetTGF-beta receptor type-1
LigandBDBM50255908
Substrate/Competitorn/a
Meas. Tech.ChEMBL_516219 (CHEMBL985076)
Ki 15±n/a nM
Citation Bonafoux, DChuaqui, CBoriack-Sjodin, PAFitch, CHankins, GJosiah, SBlack, CHetu, GLing, LLee, WC 2-Aminoimidazoles inhibitors of TGF-beta receptor 1. Bioorg Med Chem Lett19:912-6 (2009) 
 
TGF-beta receptor type-1
Name:TGF-beta receptor type-1
Type:enzyme
Mol. Mass.:55968.24
Organism:Homo sapiens (Human)
Description:P36897
Residue:503
BDBM50255908
NameBDBM50255908
Synonyms:4-(5-([1,2,4]triazolo[1,5-a]pyridin-6-yl)-4-(5-fluoro-6-methylpyridin-2-yl)-1H-imidazol-2-yl)morpholine | CHEMBL520104
TypeSmall organic molecule
Emp. Form.C19H18FN7O
Mol. Mass.379.3909
SMILESCc1nc(ccc1F)-c1nc([nH]c1-c1ccc2ncnn2c1)N1CCOCC1