Reaction Details
TargetTGF-beta receptor type-1
LigandBDBM50255906
Substrate/Competitorn/a
Meas. Tech.ChEMBL_516219 (CHEMBL985076)
Ki 19±n/a nM
Citation Bonafoux, DChuaqui, CBoriack-Sjodin, PAFitch, CHankins, GJosiah, SBlack, CHetu, GLing, LLee, WC 2-Aminoimidazoles inhibitors of TGF-beta receptor 1. Bioorg Med Chem Lett19:912-6 (2009) 
 
TGF-beta receptor type-1
Name:TGF-beta receptor type-1
Type:enzyme
Mol. Mass.:55968.24
Organism:Homo sapiens (Human)
Description:P36897
Residue:503
BDBM50255906
NameBDBM50255906
Synonyms:CHEMBL480731 | N-(4-(5-fluoro-6-methylpyridin-2-yl)-5-(quinoxalin-6-yl)-1H-imidazol-2-yl)-3-methoxypropanamide
TypeSmall organic molecule
Emp. Form.C21H19FN6O2
Mol. Mass.406.413
SMILESCOCCC(=O)Nc1nc(c([nH]1)-c1ccc2nccnc2c1)-c1ccc(F)c(C)n1