Reaction Details
TargetTGF-beta receptor type-1
LigandBDBM50255959
Substrate/Competitorn/a
Meas. Tech.ChEMBL_516220 (CHEMBL985077)
IC50 33.5±n/a nM
Citation Bonafoux, DChuaqui, CBoriack-Sjodin, PAFitch, CHankins, GJosiah, SBlack, CHetu, GLing, LLee, WC 2-Aminoimidazoles inhibitors of TGF-beta receptor 1. Bioorg Med Chem Lett19:912-6 (2009) 
 
TGF-beta receptor type-1
Name:TGF-beta receptor type-1
Type:enzyme
Mol. Mass.:55968.24
Organism:Homo sapiens (Human)
Description:P36897
Residue:503
BDBM50255959
NameBDBM50255959
Synonyms:4-(5-fluoro-6-methylpyridin-2-yl)-5-(quinoxalin-6-yl)-1H-imidazol-2-amine | CHEMBL480742
TypeSmall organic molecule
Emp. Form.C17H13FN6
Mol. Mass.320.3237
SMILESCc1nc(ccc1F)-c1nc(N)[nH]c1-c1ccc2nccnc2c1