Reaction Details
TargetTGF-beta receptor type-1
LigandBDBM50255958
Substrate/Competitorn/a
Meas. Tech.ChEMBL_516221 (CHEMBL985078)
EC50 41200±n/a nM
Citation Bonafoux, DChuaqui, CBoriack-Sjodin, PAFitch, CHankins, GJosiah, SBlack, CHetu, GLing, LLee, WC 2-Aminoimidazoles inhibitors of TGF-beta receptor 1. Bioorg Med Chem Lett19:912-6 (2009) 
 
TGF-beta receptor type-1
Name:TGF-beta receptor type-1
Type:enzyme
Mol. Mass.:55968.24
Organism:Homo sapiens (Human)
Description:P36897
Residue:503
BDBM50255958
NameBDBM50255958
Synonyms:6-(4-(5-fluoro-6-methylpyridin-2-yl)-2-(4-(methylsulfonyl)piperazin-1-yl)-1H-imidazol-5-yl)-[1,2,4]triazolo[1,5-a]pyridine | CHEMBL480583
TypeSmall organic molecule
Emp. Form.C20H21FN8O2S
Mol. Mass.456.497
SMILESCc1nc(ccc1F)-c1nc([nH]c1-c1ccc2ncnn2c1)N1CCN(CC1)S(C)(=O)=O