Reaction Details
TargetTGF-beta receptor type-1
LigandBDBM50255231
Substrate/Competitorn/a
Meas. Tech.ChEMBL_516220 (CHEMBL985077)
EC50 61±n/a nM
Citation Bonafoux, DChuaqui, CBoriack-Sjodin, PAFitch, CHankins, GJosiah, SBlack, CHetu, GLing, LLee, WC 2-Aminoimidazoles inhibitors of TGF-beta receptor 1. Bioorg Med Chem Lett19:912-6 (2009) 
 
TGF-beta receptor type-1
Name:TGF-beta receptor type-1
Type:enzyme
Mol. Mass.:55968.24
Organism:Homo sapiens (Human)
Description:P36897
Residue:503
BDBM50255231
NameBDBM50255231
Synonyms:CHEMBL479262 | N-(4-(5-fluoro-6-methylpyridin-2-yl)-5-(quinoxalin-6-yl)-1H-imidazol-2-yl)-2-methoxyacetamide
TypeSmall organic molecule
Emp. Form.C20H17FN6O2
Mol. Mass.392.3864
SMILESCOCC(=O)Nc1nc(c([nH]1)-c1ccc2nccnc2c1)-c1ccc(F)c(C)n1