Reaction Details
TargetTGF-beta receptor type-1
LigandBDBM50255228
Substrate/Competitorn/a
Meas. Tech.ChEMBL_516220 (CHEMBL985077)
EC50 111±n/a nM
Citation Bonafoux, DChuaqui, CBoriack-Sjodin, PAFitch, CHankins, GJosiah, SBlack, CHetu, GLing, LLee, WC 2-Aminoimidazoles inhibitors of TGF-beta receptor 1. Bioorg Med Chem Lett19:912-6 (2009) 
 
TGF-beta receptor type-1
Name:TGF-beta receptor type-1
Type:enzyme
Mol. Mass.:55968.24
Organism:Homo sapiens (Human)
Description:P36897
Residue:503
BDBM50255228
NameBDBM50255228
Synonyms:CHEMBL517068 | N-(5-([1,2,4]triazolo[1,5-a]pyridin-6-yl)-4-(5-fluoro-6-methylpyridin-2-yl)-1H-imidazol-2-yl)acetamide
TypeSmall organic molecule
Emp. Form.C17H14FN7O
Mol. Mass.351.3378
SMILESCC(=O)Nc1nc(c([nH]1)-c1ccc2ncnn2c1)-c1ccc(F)c(C)n1