Reaction Details
TargetBaculoviral IAP repeat-containing protein 2
LigandBDBM26218
Substrate/Competitorn/a
Meas. Tech.ChEMBL_516265 (CHEMBL985935)
Ki 0.8±n/a nM
Citation Sun, WNikolovska-Coleska, ZQin, DSun, HYang, CYBai, LQiu, SWang, YMa, DWang, S Design, synthesis, and evaluation of potent, nonpeptidic mimetics of second mitochondria-derived activator of caspases. J Med Chem52:593-6 (2009) 
 
Baculoviral IAP repeat-containing protein 2
Name:Baculoviral IAP repeat-containing protein 2
Type:Protein
Mol. Mass.:69900.47
Organism:Homo sapiens (Human)
Description:Q13490
Residue:618
BDBM26218
NameBDBM26218
Synonyms:(3S,6S,10aS)-N-(diphenylmethyl)-6-[(2S)-2-(methylamino)propanamido]-5-oxo-decahydropyrrolo[1,2-a]azocine-3-carboxamide bicyclic Smac peptide mimetic, 20
TypeSmall organic molecule
Emp. Form.C28H36N4O3
Mol. Mass.476.6104
SMILESCN[C@@H](C)C(=O)N[C@H]1CCCC[C@H]2CC[C@H](N2C1=O)C(=O)NC(c1ccccc1)c1ccccc1