Reaction Details
TargetBaculoviral IAP repeat-containing protein 3
LigandBDBM50255183
Substrate/Competitorn/a
Meas. Tech.ChEMBL_516266 (CHEMBL985936)
Ki 0.25±n/a nM
Citation Sun, WNikolovska-Coleska, ZQin, DSun, HYang, CYBai, LQiu, SWang, YMa, DWang, S Design, synthesis, and evaluation of potent, nonpeptidic mimetics of second mitochondria-derived activator of caspases. J Med Chem52:593-6 (2009) 
 
Baculoviral IAP repeat-containing protein 3
Name:Baculoviral IAP repeat-containing protein 3
Type:Protein
Mol. Mass.:68365.75
Organism:Homo sapiens (Human)
Description:Q13489
Residue:604
BDBM50255183
NameBDBM50255183
Synonyms:(1S,3S,6S,10aS)-1-benzyl-6-((S)-2-(methylamino)propanamido)-5-oxo-N-((R)-1,2,3,4-tetrahydronaphthalen-1-yl)decahydropyrrolo[1,2-a]azocine-3-carboxamide | CHEMBL475670
TypeSmall organic molecule
Emp. Form.C32H42N4O3
Mol. Mass.530.7009
SMILESCN[C@@H](C)C(=O)N[C@H]1CCCC[C@H]2[C@@H](Cc3ccccc3)C[C@H](N2C1=O)C(=O)N[C@@H]1CCCc2ccccc12