Reaction Details
TargetAdenosine receptor A2a
LigandBDBM50266381
Substrate/Competitorn/a
Meas. Tech.ChEMBL_516361 (CHEMBL987748)
Ki 12±n/a nM
Citation Lanier, MCMoorjani, MLuo, ZChen, YLin, ETellew, JEZhang, XWilliams, JPGross, RSLechner, SMMarkison, SJoswig, TKargo, WPiercey, JSantos, MMalany, SZhao, MPetroski, RCrespo, MIDíaz, JLSaunders, JWen, JO'Brien, ZJalali, KMadan, ASlee, DH N-[6-amino-2-(heteroaryl)pyrimidin-4-yl]acetamides as A2A receptor antagonists with improved drug like properties and in vivo efficacy. J Med Chem52:709-17 (2009) 
 
Adenosine receptor A2a
Name:Adenosine receptor A2a
Type:G Protein-Coupled Receptor (GPCR)
Mol. Mass.:44716.46
Organism:Homo sapiens (Human)
Description:P29274
Residue:412
BDBM50266381
NameBDBM50266381
Synonyms:CHEMBL515992 | N-[2-(3,5-Dimethylpyrazol-1-yl)-6-(2-oxopyrrolidin-1-yl)pyrimidin-4-yl]acetamide
TypeSmall organic molecule
Emp. Form.C15H18N6O2
Mol. Mass.314.3424
SMILESCC(=O)Nc1cc(nc(n1)-n1nc(C)cc1C)N1CCCC1=O