Reaction Details
Target5-hydroxytryptamine receptor 1A
LigandBDBM50277145
Substrate/Competitorn/a
Meas. Tech.ChEMBL_540736 (CHEMBL1030618)
Ki 5.2±n/a nM
Citation Dounay, ABBarta, NSBikker, JABorosky, SACampbell, BMCrawford, TDenny, LEvans, LMGray, DLLee, PLenoir, EAXu, W Synthesis and pharmacological evaluation of aminopyrimidine series of 5-HT1A partial agonists. Bioorg Med Chem Lett19:1159-63 (2009) 
 
5-hydroxytryptamine receptor 1A
Name:5-hydroxytryptamine receptor 1A
Type:n/a
Mol. Mass.:46122.49
Organism:Homo sapiens (Human)
Description:n/a
Residue:422
BDBM50277145
NameBDBM50277145
Synonyms:(+/-)-4-(1-(2-(1H-indol-3-yl)ethyl)piperidin-3-yl)-N-tert-butylpyrimidin-2-amine | CHEMBL475516
TypeSmall organic molecule
Emp. Form.C23H31N5
Mol. Mass.377.5257
SMILESCC(C)(C)Nc1nccc(n1)C1CCCN(CCc2c[nH]c3ccccc23)C1