Reaction Details
Target5-hydroxytryptamine receptor 1A
LigandBDBM50277180
Substrate/Competitorn/a
Meas. Tech.ChEMBL_540736 (CHEMBL1030618)
Ki 10.4±n/a nM
Citation Dounay, ABBarta, NSBikker, JABorosky, SACampbell, BMCrawford, TDenny, LEvans, LMGray, DLLee, PLenoir, EAXu, W Synthesis and pharmacological evaluation of aminopyrimidine series of 5-HT1A partial agonists. Bioorg Med Chem Lett19:1159-63 (2009) 
 
5-hydroxytryptamine receptor 1A
Name:5-hydroxytryptamine receptor 1A
Type:n/a
Mol. Mass.:46122.49
Organism:Homo sapiens (Human)
Description:n/a
Residue:422
BDBM50277180
NameBDBM50277180
Synonyms:4-(1-(2-(5-chloro-1H-indol-3-yl)ethyl)piperidin-3-yl)-N-cyclopropylpyrimidin-2-amine | CHEMBL514823
TypeSmall organic molecule
Emp. Form.C22H26ClN5
Mol. Mass.395.928
SMILESClc1ccc2[nH]cc(CCN3CCCC(C3)c3ccnc(NC4CC4)n3)c2c1