Reaction Details
Target5-hydroxytryptamine receptor 1A
LigandBDBM50277182
Substrate/Competitorn/a
Meas. Tech.ChEMBL_540736 (CHEMBL1030618)
Ki 35.1±n/a nM
Citation Dounay, ABBarta, NSBikker, JABorosky, SACampbell, BMCrawford, TDenny, LEvans, LMGray, DLLee, PLenoir, EAXu, W Synthesis and pharmacological evaluation of aminopyrimidine series of 5-HT1A partial agonists. Bioorg Med Chem Lett19:1159-63 (2009) 
 
5-hydroxytryptamine receptor 1A
Name:5-hydroxytryptamine receptor 1A
Type:n/a
Mol. Mass.:46122.49
Organism:Homo sapiens (Human)
Description:n/a
Residue:422
BDBM50277182
NameBDBM50277182
Synonyms:CHEMBL475694 | N-cyclopropyl-4-(1-(2-(7-fluoro-1H-indol-3-yl)ethyl)piperidin-3-yl)pyrimidin-2-amine
TypeSmall organic molecule
Emp. Form.C22H26FN5
Mol. Mass.379.4737
SMILESFc1cccc2c(CCN3CCCC(C3)c3ccnc(NC4CC4)n3)c[nH]c12