Reaction Details
Target5-hydroxytryptamine receptor 1A
LigandBDBM50277211
Substrate/Competitorn/a
Meas. Tech.ChEMBL_540736 (CHEMBL1030618)
Ki 42.5±n/a nM
Citation Dounay, ABBarta, NSBikker, JABorosky, SACampbell, BMCrawford, TDenny, LEvans, LMGray, DLLee, PLenoir, EAXu, W Synthesis and pharmacological evaluation of aminopyrimidine series of 5-HT1A partial agonists. Bioorg Med Chem Lett19:1159-63 (2009) 
 
5-hydroxytryptamine receptor 1A
Name:5-hydroxytryptamine receptor 1A
Type:n/a
Mol. Mass.:46122.49
Organism:Homo sapiens (Human)
Description:n/a
Residue:422
BDBM50277211
NameBDBM50277211
Synonyms:CHEMBL475090 | N-cyclopropyl-4-(1-(2-(2,3-dihydro-1H-inden-2-yl)ethyl)piperidin-3-yl)pyrimidin-2-amine
TypeSmall organic molecule
Emp. Form.C23H30N4
Mol. Mass.362.5111
SMILESC(CN1CCCC(C1)c1ccnc(NC2CC2)n1)C1Cc2ccccc2C1