Reaction Details
Target5-hydroxytryptamine receptor 1A
LigandBDBM50277130
Substrate/Competitorn/a
Meas. Tech.ChEMBL_540738 (CHEMBL1030620)
EC50 147±n/a nM
Citation Dounay, ABBarta, NSBikker, JABorosky, SACampbell, BMCrawford, TDenny, LEvans, LMGray, DLLee, PLenoir, EAXu, W Synthesis and pharmacological evaluation of aminopyrimidine series of 5-HT1A partial agonists. Bioorg Med Chem Lett19:1159-63 (2009) 
 
5-hydroxytryptamine receptor 1A
Name:5-hydroxytryptamine receptor 1A
Type:n/a
Mol. Mass.:46122.49
Organism:Homo sapiens (Human)
Description:n/a
Residue:422
BDBM50277130
NameBDBM50277130
Synonyms:(+/-)-4-(1-(2-(1H-indol-3-yl)ethyl)piperidin-3-yl)-N-(cyclopropylmethyl)pyrimidin-2-amine | CHEMBL515438
TypeSmall organic molecule
Emp. Form.C23H29N5
Mol. Mass.375.5099
SMILESC(Cc1c[nH]c2ccccc12)N1CCCC(C1)c1ccnc(NCC2CC2)n1