Reaction Details
Target5-hydroxytryptamine receptor 1A
LigandBDBM50277146
Substrate/Competitorn/a
Meas. Tech.ChEMBL_540738 (CHEMBL1030620)
EC50 302±n/a nM
Citation Dounay, ABBarta, NSBikker, JABorosky, SACampbell, BMCrawford, TDenny, LEvans, LMGray, DLLee, PLenoir, EAXu, W Synthesis and pharmacological evaluation of aminopyrimidine series of 5-HT1A partial agonists. Bioorg Med Chem Lett19:1159-63 (2009) 
 
5-hydroxytryptamine receptor 1A
Name:5-hydroxytryptamine receptor 1A
Type:n/a
Mol. Mass.:46122.49
Organism:Homo sapiens (Human)
Description:n/a
Residue:422
BDBM50277146
NameBDBM50277146
Synonyms:(+)-4-(1-(2-(1H-indol-3-yl)ethyl)piperidin-3-yl)-N-propylpyrimidin-2-amine CHEMBL473902
TypeSmall organic molecule
Emp. Form.C22H29N5
Mol. Mass.363.4992
SMILESCCCNc1nccc(n1)C1CCCN(CCc2c[nH]c3ccccc23)C1