Reaction Details
TargetMu-type opioid receptor
LigandBDBM50266420
Substrate/Competitorn/a
Meas. Tech.ChEMBL_517099 (CHEMBL988704)
Ki>1000±n/a nM
Citation Béguin, CDuncan, KKMunro, TAHo, DMXu, WLiu-Chen, LYCarlezon, WACohen, BM Modification of the furan ring of salvinorin A: identification of a selective partial agonist at the kappa opioid receptor. Bioorg Med Chem17:1370-80 (2009) 
 
Mu-type opioid receptor
Name:Mu-type opioid receptor
Type:G Protein-Coupled Receptor (GPCR)
Mol. Mass.:44503.11
Organism:Rattus norvegicus (rat)
Description:Competition binding assays were carried out using membrane preparations from transfected HN9.10 cells that constitutively expressed the mu opioid receptor.
Residue:398
BDBM50266420
NameBDBM50266420
Synonyms:(2S,4aR,6aR,7R,9S,10aS,10bR)-2-ethyl 7-methyl 9-acetoxy-6a,10b-dimethyl-4,10-dioxododecahydro-1H-benzo[f]isochromene-2,7-dicarboxylate US8492564, 19
TypeSmall organic molecule
Emp. Form.C22H30O9
Mol. Mass.438.4682
SMILESCCOC(=O)[C@@H]1C[C@@]2(C)[C@@H](CC[C@@]3(C)[C@@H](C[C@H](OC(C)=O)C(=O)[C@H]23)C(=O)OC)C(=O)O1