Reaction Details
TargetDelta-type opioid receptor
LigandBDBM50266419
Substrate/Competitorn/a
Meas. Tech.ChEMBL_517100 (CHEMBL988705)
Ki>1000±n/a nM
Citation Béguin, CDuncan, KKMunro, TAHo, DMXu, WLiu-Chen, LYCarlezon, WACohen, BM Modification of the furan ring of salvinorin A: identification of a selective partial agonist at the kappa opioid receptor. Bioorg Med Chem17:1370-80 (2009) 
 
Delta-type opioid receptor
Name:Delta-type opioid receptor
Type:Enzyme Catalytic Domain
Mol. Mass.:40577.25
Organism:MOUSE
Description:P32300
Residue:372
BDBM50266419
NameBDBM50266419
Synonyms:(2S,4aR,6aR,7R,9S,10aS,10bR)-dimethyl 9-acetoxy-6a,10b-dimethyl-4,10-dioxododecahydro-1H-benzo[f]isochromene-2,7-dicarboxylate US8492564, 18
TypeSmall organic molecule
Emp. Form.C21H28O9
Mol. Mass.424.4416
SMILESCOC(=O)[C@@H]1C[C@@]2(C)[C@@H](CC[C@@]3(C)[C@@H](C[C@H](OC(C)=O)C(=O)[C@H]23)C(=O)OC)C(=O)O1