Reaction Details
TargetKappa-type opioid receptor
LigandBDBM50266445
Substrate/Competitorn/a
Meas. Tech.ChEMBL_517096 (CHEMBL988701)
Ki 109±n/a nM
Citation Béguin, CDuncan, KKMunro, TAHo, DMXu, WLiu-Chen, LYCarlezon, WACohen, BM Modification of the furan ring of salvinorin A: identification of a selective partial agonist at the kappa opioid receptor. Bioorg Med Chem17:1370-80 (2009) 
 
Kappa-type opioid receptor
Name:Kappa-type opioid receptor
Type:G Protein-Coupled Receptor (GPCR)
Mol. Mass.:42648.76
Organism:Homo sapiens (Human)
Description:P41145
Residue:380
BDBM50266445
NameBDBM50266445
Synonyms:(2S,4aR,6aR,7R,9S,10aS,10bR)-2-isopropyl 7-methyl 9-acetoxy-6a,10b-dimethyl-4,10-dioxododecahydro-1H-benzo[f]isochromene-2,7-dicarboxylate US8492564, 20
TypeSmall organic molecule
Emp. Form.C23H32O9
Mol. Mass.452.4948
SMILESCOC(=O)[C@@H]1C[C@H](OC(C)=O)C(=O)[C@H]2[C@@]1(C)CC[C@H]1C(=O)O[C@@H](C[C@]21C)C(=O)OC(C)C