Reaction Details
TargetD(3) dopamine receptor
LigandBDBM50277041
Substrate/Competitorn/a
Meas. Tech.ChEMBL_540793 (CHEMBL1033196)
Ki 11±n/a nM
Citation Sikazwe, DMNkansah, NTAltundas, RZhu, XYRoth, BLSetola, VAblordeppey, SY Synthesis and evaluation of ligands for D2-like receptors: the role of common pharmacophoric groups. Bioorg Med Chem17:1716-23 (2009) 
 
D(3) dopamine receptor
Name:D(3) dopamine receptor
Type:n/a
Mol. Mass.:44243.43
Organism:Homo sapiens (Human)
Description:n/a
Residue:400
BDBM50277041
NameBDBM50277041
Synonyms:2-{(1H-Pyrrolo[2,3-b]pyridin-3-yl)methyl}-5-(4-chlorophenyl)-2,5-diazabicyclo[2.2.1]heptane | CHEMBL514747
TypeSmall organic molecule
Emp. Form.C19H19ClN4
Mol. Mass.338.834
SMILESClc1ccc(cc1)N1CC2CC1CN2Cc1c[nH]c2ncccc12