Reaction Details
TargetD(4) dopamine receptor
LigandBDBM50185474
Substrate/Competitorn/a
Meas. Tech.ChEMBL_541031 (CHEMBL1024731)
Ki 11±n/a nM
Citation Sikazwe, DMNkansah, NTAltundas, RZhu, XYRoth, BLSetola, VAblordeppey, SY Synthesis and evaluation of ligands for D2-like receptors: the role of common pharmacophoric groups. Bioorg Med Chem17:1716-23 (2009) 
 
D(4) dopamine receptor
Name:D(4) dopamine receptor
Type:Enzyme
Mol. Mass.:48373.19
Organism:Homo sapiens (Human)
Description:P21917
Residue:419
BDBM50185474
NameBDBM50185474
Synonyms:(+)-4-(3-(4-chlorophenyl)-3-hydroxypyrrolidin-1-yl)-1-(4-fluorophenyl)butan-1-one (-)-4-(3-(4-chlorophenyl)-3-hydroxypyrrolidin-1-yl)-1-(4-fluorophenyl)butan-1-one 4-(3-(4-chlorophenyl)-3-hydroxypyrrolidin-1-yl)-1-(4-fluorophenyl)butan-1-one 4-{3-(4-chlorophenyl)-3-hydroxypyrrolidin-1-yl}-1-(4-fluorophenyl)butan-1-one | CHEMBL150161
TypeSmall organic molecule
Emp. Form.C20H21ClFNO2
Mol. Mass.361.838
SMILESOC1(CCN(CCCC(=O)c2ccc(F)cc2)C1)c1ccc(Cl)cc1