Reaction Details
TargetC-C chemokine receptor type 5
LigandBDBM50276792
Substrate/Competitorn/a
Meas. Tech.ChEMBL_540889 (CHEMBL1026563)
IC50 102±n/a nM
Citation Pryde, DCCorless, MFenwick, DRMason, HJStammen, BCStephenson, PTEllis, DBachelor, DGordon, DBarber, CGWood, AMiddleton, DSBlakemore, DCParsons, GCEastwood, RPlatts, MYStatham, KParadowski, KABurt, CKlute, W The design and discovery of novel amide CCR5 antagonists. Bioorg Med Chem Lett19:1084-8 (2009) 
 
C-C chemokine receptor type 5
Name:C-C chemokine receptor type 5
Type:Enzyme
Mol. Mass.:40540.21
Organism:Homo sapiens (Human)
Description:P51681
Residue:352
BDBM50276792
NameBDBM50276792
Synonyms:(3-((1-benzhydrylpiperidin-4-yl)(methyl)amino)azetidin-1-yl)(2,4-dimethylpyridin-3-yl)methanone | CHEMBL459985
TypeSmall organic molecule
Emp. Form.C30H36N4O
Mol. Mass.468.633
SMILESCN(C1CN(C1)C(=O)c1c(C)ccnc1C)C1CCN(CC1)C(c1ccccc1)c1ccccc1