Reaction Details
TargetC-C chemokine receptor type 5
LigandBDBM50276260
Substrate/Competitorn/a
Meas. Tech.ChEMBL_540889 (CHEMBL1026563)
IC50 1±n/a nM
Citation Pryde, DCCorless, MFenwick, DRMason, HJStammen, BCStephenson, PTEllis, DBachelor, DGordon, DBarber, CGWood, AMiddleton, DSBlakemore, DCParsons, GCEastwood, RPlatts, MYStatham, KParadowski, KABurt, CKlute, W The design and discovery of novel amide CCR5 antagonists. Bioorg Med Chem Lett19:1084-8 (2009) 
 
C-C chemokine receptor type 5
Name:C-C chemokine receptor type 5
Type:Enzyme
Mol. Mass.:40540.21
Organism:Homo sapiens (Human)
Description:P51681
Residue:352
BDBM50276260
NameBDBM50276260
Synonyms:(R)-N-benzyl-N-(1-(1-(2,6-dimethylbenzoyl)piperidin-4-yl)pyrrolidin-3-yl)cyclopropanecarboxamide | CHEMBL471623
TypeSmall organic molecule
Emp. Form.C29H37N3O2
Mol. Mass.459.623
SMILESCc1cccc(C)c1C(=O)N1CCC(CC1)N1CC[C@H](C1)N(Cc1ccccc1)C(=O)C1CC1