Reaction Details
TargetSterol O-acyltransferase 1
LigandBDBM50276564
Substrate/Competitorn/a
Meas. Tech.ChEMBL_540911 (CHEMBL1027336)
IC50 68±n/a nM
Citation Asano, SBan, HKino, KIoriya, KMuraoka, M Novel 1,4-diarylpiperidine-4-methylureas as anti-hyperlipidemic agents: dual effectors on acyl-CoA:cholesterol O-acyltransferase and low-density lipoprotein receptor expression. Bioorg Med Chem Lett19:1062-5 (2009) 
 
Sterol O-acyltransferase 1
Name:Sterol O-acyltransferase 1
Type:Multi-pass membrane protein may form homo- or heterodimers.
Mol. Mass.:64751.94
Organism:Homo sapiens (Human)
Description:P35610
Residue:550
BDBM50276564
NameBDBM50276564
Synonyms:1-(4-amino-2,6-diisopropylphenyl)-3-((4-(3-methoxyphenyl)-1-(2-(trifluoromethoxy)phenyl)piperidin-4-yl)methyl)urea dihydrochloride | CHEMBL509834
TypeSmall organic molecule
Emp. Form.C33H41F3N4O3
Mol. Mass.598.6988
SMILESCOc1cccc(c1)C1(CNC(=O)Nc2c(cc(N)cc2C(C)C)C(C)C)CCN(CC1)c1ccccc1OC(F)(F)F