Reaction Details
TargetSterol O-acyltransferase 1
LigandBDBM50175765
Substrate/Competitorn/a
Meas. Tech.ChEMBL_540911 (CHEMBL1027336)
IC50 31±n/a nM
Citation Asano, SBan, HKino, KIoriya, KMuraoka, M Novel 1,4-diarylpiperidine-4-methylureas as anti-hyperlipidemic agents: dual effectors on acyl-CoA:cholesterol O-acyltransferase and low-density lipoprotein receptor expression. Bioorg Med Chem Lett19:1062-5 (2009) 
 
Sterol O-acyltransferase 1
Name:Sterol O-acyltransferase 1
Type:Multi-pass membrane protein may form homo- or heterodimers.
Mol. Mass.:64751.94
Organism:Homo sapiens (Human)
Description:P35610
Residue:550
BDBM50175765
NameBDBM50175765
Synonyms:1-(4-amino-2,6-diisopropylphenyl)-3-(1-butyl-4-(3-(3-hydroxypropoxy)phenyl)-2-oxo-1,2-dihydro-1,8-naphthyridin-3-yl)urea hydrochloride CHEMBL539597 | CHEMBL573970
TypeSmall organic molecule
Emp. Form.C34H43N5O4
Mol. Mass.585.7363
SMILESCCCCn1c2ncccc2c(-c2cccc(OCCCO)c2)c(NC(=O)Nc2c(cc(N)cc2C(C)C)C(C)C)c1=O