Reaction Details
TargetDelta-type opioid receptor
LigandBDBM50276567
Substrate/Competitorn/a
Meas. Tech.ChEMBL_540961 (CHEMBL1030681)
IC50>10000±n/a nM
Citation Dockendorff, CJin, SOlsen, MLautens, MCoupal, MHodzic, LSpear, NPayza, KWalpole, CTomaszewski, MJ Discovery of mu-opioid selective ligands derived from 1-aminotetralin scaffolds made via metal-catalyzed ring-opening reactions. Bioorg Med Chem Lett19:1228-32 (2009) 
 
Delta-type opioid receptor
Name:Delta-type opioid receptor
Type:G Protein-Coupled Receptor (GPCR)
Mol. Mass.:40382.98
Organism:Homo sapiens (Human)
Description:Competition binding assays were carried out using membrane preparations from transfected HN9.10 cells that constitutively expressed the delta opioid receptor.
Residue:372
BDBM50276567
NameBDBM50276567
Synonyms:(+/-)-2-(2-bromophenyl)-N-(2-(dimethylamino)-6,7-dimethoxy-1,2,3,4-tetrahydronaphthalen-1-yl)-N-(2-methoxyethyl)acetamide | CHEMBL459388
TypeSmall organic molecule
Emp. Form.C25H33BrN2O4
Mol. Mass.505.445
SMILESCOCCN(C1C(CCc2cc(OC)c(OC)cc12)N(C)C)C(=O)Cc1ccccc1Br