Reaction Details
TargetDelta-type opioid receptor
LigandBDBM50276444
Substrate/Competitorn/a
Meas. Tech.ChEMBL_540961 (CHEMBL1030681)
IC50 3887±n/a nM
Citation Dockendorff, CJin, SOlsen, MLautens, MCoupal, MHodzic, LSpear, NPayza, KWalpole, CTomaszewski, MJ Discovery of mu-opioid selective ligands derived from 1-aminotetralin scaffolds made via metal-catalyzed ring-opening reactions. Bioorg Med Chem Lett19:1228-32 (2009) 
 
Delta-type opioid receptor
Name:Delta-type opioid receptor
Type:G Protein-Coupled Receptor (GPCR)
Mol. Mass.:40382.98
Organism:Homo sapiens (Human)
Description:Competition binding assays were carried out using membrane preparations from transfected HN9.10 cells that constitutively expressed the delta opioid receptor.
Residue:372
BDBM50276444
NameBDBM50276444
Synonyms:(+/-)-2-(benzyloxy)-N-(2-methoxyethyl)-N-(2-(4-phenylpiperazin-1-yl)-1,2-dihydronaphthalen-1-yl)acetamide | CHEMBL459573
TypeSmall organic molecule
Emp. Form.C32H37N3O3
Mol. Mass.511.6545
SMILESCOCCN(C1C(C=Cc2ccccc12)N1CCN(CC1)c1ccccc1)C(=O)COCc1ccccc1