Reaction Details
TargetMu-type opioid receptor
LigandBDBM50276363
Substrate/Competitorn/a
Meas. Tech.ChEMBL_540959 (CHEMBL1030679)
IC50 69±n/a nM
Citation Dockendorff, CJin, SOlsen, MLautens, MCoupal, MHodzic, LSpear, NPayza, KWalpole, CTomaszewski, MJ Discovery of mu-opioid selective ligands derived from 1-aminotetralin scaffolds made via metal-catalyzed ring-opening reactions. Bioorg Med Chem Lett19:1228-32 (2009) 
 
Mu-type opioid receptor
Name:Mu-type opioid receptor
Type:G Protein-Coupled Receptor (GPCR)
Mol. Mass.:44789.51
Organism:Homo sapiens (Human)
Description:P35372
Residue:400
BDBM50276363
NameBDBM50276363
Synonyms:(+/-)-N-(2-methoxyethyl)-2-(thiophen-3-yl)-1,2,3,4-tetrahydronaphthalen-1-amine | CHEMBL450500
TypeSmall organic molecule
Emp. Form.C17H21NOS
Mol. Mass.287.42
SMILESCOCCNC1C(CCc2ccccc12)c1ccsc1