Reaction Details
TargetKappa-type opioid receptor
LigandBDBM50276411
Substrate/Competitorn/a
Meas. Tech.ChEMBL_540960 (CHEMBL1030680)
IC50>10000±n/a nM
Citation Dockendorff, CJin, SOlsen, MLautens, MCoupal, MHodzic, LSpear, NPayza, KWalpole, CTomaszewski, MJ Discovery of mu-opioid selective ligands derived from 1-aminotetralin scaffolds made via metal-catalyzed ring-opening reactions. Bioorg Med Chem Lett19:1228-32 (2009) 
 
Kappa-type opioid receptor
Name:Kappa-type opioid receptor
Type:G Protein-Coupled Receptor (GPCR)
Mol. Mass.:42648.76
Organism:Homo sapiens (Human)
Description:P41145
Residue:380
BDBM50276411
NameBDBM50276411
Synonyms:(+/-)-N-(2-methoxyethyl)-N-(2-(4-phenylpiperazin-1-yl)-1,2-dihydronaphthalen-1-yl)furan-2-carboxamide | CHEMBL460623
TypeSmall organic molecule
Emp. Form.C28H31N3O3
Mol. Mass.457.564
SMILESCOCCN(C1C(C=Cc2ccccc12)N1CCN(CC1)c1ccccc1)C(=O)c1ccco1