Reaction Details
TargetKappa-type opioid receptor
LigandBDBM50276566
Substrate/Competitorn/a
Meas. Tech.ChEMBL_540960 (CHEMBL1030680)
IC50 922±n/a nM
Citation Dockendorff, CJin, SOlsen, MLautens, MCoupal, MHodzic, LSpear, NPayza, KWalpole, CTomaszewski, MJ Discovery of mu-opioid selective ligands derived from 1-aminotetralin scaffolds made via metal-catalyzed ring-opening reactions. Bioorg Med Chem Lett19:1228-32 (2009) 
 
Kappa-type opioid receptor
Name:Kappa-type opioid receptor
Type:G Protein-Coupled Receptor (GPCR)
Mol. Mass.:42648.76
Organism:Homo sapiens (Human)
Description:P41145
Residue:380
BDBM50276566
NameBDBM50276566
Synonyms:(+/-)-2-(4-chlorophenyl)-N-(2-(dimethylamino)-6,7-dimethoxy-1,2,3,4-tetrahydronaphthalen-1-yl)-N-(2-methoxyethyl)acetamide | CHEMBL459387
TypeSmall organic molecule
Emp. Form.C25H33ClN2O4
Mol. Mass.460.994
SMILESCOCCN(C1C(CCc2cc(OC)c(OC)cc12)N(C)C)C(=O)Cc1ccc(Cl)cc1