Reaction Details
TargetMu-type opioid receptor
LigandBDBM50276412
Substrate/Competitorn/a
Meas. Tech.ChEMBL_540966 (CHEMBL1028123)
EC50>90000±n/a nM
Citation Dockendorff, CJin, SOlsen, MLautens, MCoupal, MHodzic, LSpear, NPayza, KWalpole, CTomaszewski, MJ Discovery of mu-opioid selective ligands derived from 1-aminotetralin scaffolds made via metal-catalyzed ring-opening reactions. Bioorg Med Chem Lett19:1228-32 (2009) 
 
Mu-type opioid receptor
Name:Mu-type opioid receptor
Type:G Protein-Coupled Receptor (GPCR)
Mol. Mass.:44789.51
Organism:Homo sapiens (Human)
Description:P35372
Residue:400
BDBM50276412
NameBDBM50276412
Synonyms:(+/-)-3,4-dichloro-N-(2-methoxyethyl)-N-(2-(4-phenylpiperazin-1-yl)-1,2-dihydronaphthalen-1-yl)benzamide | CHEMBL460832
TypeSmall organic molecule
Emp. Form.C30H31Cl2N3O2
Mol. Mass.536.492
SMILESCOCCN(C1C(C=Cc2ccccc12)N1CCN(CC1)c1ccccc1)C(=O)c1ccc(Cl)c(Cl)c1