Reaction Details
TargetSodium- and chloride-dependent glycine transporter 1
LigandBDBM50248059
Substrate/Competitorn/a
Meas. Tech.ChEMBL_542992 (CHEMBL1018608)
IC50 4±n/a nM
Citation Zhao, ZLeister, WHO'Brien, JALemaire, WWilliams, DLJacobson, MASur, CKinney, GGPettibone, DJTiller, PRSmith, SHartman, GDLindsley, CWWolkenberg, SE Discovery of N-{[1-(propylsulfonyl)-4-pyridin-2-ylpiperidin-4-yl]methyl}benzamides as novel, selective and potent GlyT1 inhibitors. Bioorg Med Chem Lett19:1488-91 (2009) 
 
Sodium- and chloride-dependent glycine transporter 1
Name:Sodium- and chloride-dependent glycine transporter 1
Type:Enzyme
Mol. Mass.:78270.54
Organism:Homo sapiens (Human)
Description:P48067
Residue:706
BDBM50248059
NameBDBM50248059
Synonyms:(S)-2-chloro-3,5-difluoro-N-(1-(1-(propylsulfonyl)-4-(pyridin-2-yl)piperidin-4-yl)ethyl)benzamide | CHEMBL517410
TypeSmall organic molecule
Emp. Form.C22H26ClF2N3O3S
Mol. Mass.485.975
SMILESCCCS(=O)(=O)N1CCC(CC1)([C@H](C)NC(=O)c1cc(F)cc(F)c1Cl)c1ccccn1