Reaction Details
TargetPolyphenol oxidase 2
LigandBDBM26190
Substrate/Competitorn/a
Meas. Tech.ChEMBL_543044 (CHEMBL1021285)
IC50 9810±n/a nM
Citation Rho, HSBaek, HSAhn, SMYoo, JWKim, DHKim, HG Studies on depigmenting activities of dihydroxyl benzamide derivatives containing adamantane moiety. Bioorg Med Chem Lett19:1532-3 (2009) 
 
Polyphenol oxidase 2
Name:Polyphenol oxidase 2
Type:Protein
Mol. Mass.:63923.66
Organism:Agaricus bisporus (Common mushroom)
Description:O42713
Residue:556
BDBM26190
NameBDBM26190
Synonyms:1,4-Dihydroxybenzene, XIII CHEMBL537 Hydroquinone, HQ phenol derivative, 4
TypeSmall organic molecule
Emp. Form.C6H6O2
Mol. Mass.110.1106
SMILESOc1ccc(O)cc1