Reaction Details
TargetHistone deacetylase 1
LigandBDBM50248315
Substrate/Competitorn/a
Meas. Tech.ChEMBL_543051 (CHEMBL1021292)
IC50 170±n/a nM
Citation Wang, HYu, NSong, HChen, DZou, YDeng, WLye, PLChang, JNg, MSun, ETSangthongpitag, KWang, XWu, XKhng, HHFang, LGoh, SKOng, WCBonday, ZStünkel, WPoulsen, AEntzeroth, M N-Hydroxy-1,2-disubstituted-1H-benzimidazol-5-yl acrylamides as novel histone deacetylase inhibitors: design, synthesis, SAR studies, and in vivo antitumor activity. Bioorg Med Chem Lett19:1403-8 (2009) 
 
Histone deacetylase 1
Name:Histone deacetylase 1
Type:Enzyme
Mol. Mass.:55090.27
Organism:Homo sapiens (Human)
Description:Q13547
Residue:482
BDBM50248315
NameBDBM50248315
Synonyms:3-(2-(benzyloxymethyl)-1-(3-hydroxypropyl)-1H-benzo[d]imidazol-5-yl)-N-hydroxyacrylamide US10201527, Compound 19 US8551988, 19
TypeSmall organic molecule
Emp. Form.C21H23N3O4
Mol. Mass.381.425
SMILESOCCCn1c(COCc2ccccc2)nc2cc(\C=C\C(=O)NO)ccc12