Reaction Details
TargetHistone deacetylase 1
LigandBDBM50248377
Substrate/Competitorn/a
Meas. Tech.ChEMBL_543051 (CHEMBL1021292)
IC50 2300±n/a nM
Citation Wang, HYu, NSong, HChen, DZou, YDeng, WLye, PLChang, JNg, MSun, ETSangthongpitag, KWang, XWu, XKhng, HHFang, LGoh, SKOng, WCBonday, ZStünkel, WPoulsen, AEntzeroth, M N-Hydroxy-1,2-disubstituted-1H-benzimidazol-5-yl acrylamides as novel histone deacetylase inhibitors: design, synthesis, SAR studies, and in vivo antitumor activity. Bioorg Med Chem Lett19:1403-8 (2009) 
 
Histone deacetylase 1
Name:Histone deacetylase 1
Type:Enzyme
Mol. Mass.:55090.27
Organism:Homo sapiens (Human)
Description:Q13547
Residue:482
BDBM50248377
NameBDBM50248377
Synonyms:3-(5-(3-(hydroxyamino)-3-oxoprop-1-enyl)-2-phenethyl-1H-benzo[d]imidazol-1-yl)propanoic acid US10201527, Compound 32 US8551988, 32
TypeSmall organic molecule
Emp. Form.C21H21N3O4
Mol. Mass.379.4091
SMILESONC(=O)\C=C\c1ccc2n(CCC(O)=O)c(CCc3ccccc3)nc2c1