Reaction Details
TargetHistone deacetylase 1
LigandBDBM50248523
Substrate/Competitorn/a
Meas. Tech.ChEMBL_543051 (CHEMBL1021292)
IC50 310±n/a nM
Citation Wang, HYu, NSong, HChen, DZou, YDeng, WLye, PLChang, JNg, MSun, ETSangthongpitag, KWang, XWu, XKhng, HHFang, LGoh, SKOng, WCBonday, ZStünkel, WPoulsen, AEntzeroth, M N-Hydroxy-1,2-disubstituted-1H-benzimidazol-5-yl acrylamides as novel histone deacetylase inhibitors: design, synthesis, SAR studies, and in vivo antitumor activity. Bioorg Med Chem Lett19:1403-8 (2009) 
 
Histone deacetylase 1
Name:Histone deacetylase 1
Type:Enzyme
Mol. Mass.:55090.27
Organism:Homo sapiens (Human)
Description:Q13547
Residue:482
BDBM50248523
NameBDBM50248523
Synonyms:CHEMBL489330 US10201527, Compound 82 US8551988, 82
TypeSmall organic molecule
Emp. Form.C25H30N4O2
Mol. Mass.418.5313
SMILESONC(=O)\C=C\c1ccc2n(CCCN3CCCC3)c(CCc3ccccc3)nc2c1