Reaction Details
TargetHistone deacetylase 1
LigandBDBM50247926
Substrate/Competitorn/a
Meas. Tech.ChEMBL_543051 (CHEMBL1021292)
IC50 1200±n/a nM
Citation Wang, HYu, NSong, HChen, DZou, YDeng, WLye, PLChang, JNg, MSun, ETSangthongpitag, KWang, XWu, XKhng, HHFang, LGoh, SKOng, WCBonday, ZStünkel, WPoulsen, AEntzeroth, M N-Hydroxy-1,2-disubstituted-1H-benzimidazol-5-yl acrylamides as novel histone deacetylase inhibitors: design, synthesis, SAR studies, and in vivo antitumor activity. Bioorg Med Chem Lett19:1403-8 (2009) 
 
Histone deacetylase 1
Name:Histone deacetylase 1
Type:Enzyme
Mol. Mass.:55090.27
Organism:Homo sapiens (Human)
Description:Q13547
Residue:482
BDBM50247926
NameBDBM50247926
Synonyms:3-(1-benzyl-2-phenethyl-1H-benzo[d]imidazol-6-yl)-N-hydroxyacrylamide US10201527, Compound 58 | US10736881, Compound 58
TypeSmall organic molecule
Emp. Form.C25H23N3O2
Mol. Mass.397.469
SMILESONC(=O)\C=C\c1ccc2nc(CCc3ccccc3)n(Cc3ccccc3)c2c1