Reaction Details
TargetSodium- and chloride-dependent glycine transporter 1
LigandBDBM50248128
Substrate/Competitorn/a
Meas. Tech.ChEMBL_543461 (CHEMBL1016009)
IC50 9.7±n/a nM
Citation Wolkenberg, SEZhao, ZWisnoski, DDLeister, WHO'Brien, JLemaire, WWilliams, DLJacobson, MASur, CKinney, GGPettibone, DJTiller, PRSmith, SGibson, CMa, BKPolsky-Fisher, SLLindsley, CWHartman, GD Discovery of GlyT1 inhibitors with improved pharmacokinetic properties. Bioorg Med Chem Lett19:1492-5 (2009) 
 
Sodium- and chloride-dependent glycine transporter 1
Name:Sodium- and chloride-dependent glycine transporter 1
Type:Enzyme
Mol. Mass.:78270.54
Organism:Homo sapiens (Human)
Description:P48067
Residue:706
BDBM50248128
NameBDBM50248128
Synonyms:2,4-dichloro-N-((1-(2-fluoropropylsulfonyl)-4-(pyridin-2-yl)piperidin-4-yl)methyl)benzamide | CHEMBL461986
TypeSmall organic molecule
Emp. Form.C21H24Cl2FN3O3S
Mol. Mass.488.403
SMILESCC(F)CS(=O)(=O)N1CCC(CNC(=O)c2ccc(Cl)cc2Cl)(CC1)c1ccccn1