Reaction Details
TargetAdenosine receptor A2a
LigandBDBM50247933
Substrate/Competitorn/a
Meas. Tech.ChEMBL_543474 (CHEMBL1018640)
Ki 261±n/a nM
Citation Shao, YCole, AGBrescia, MRQin, LYDuo, JStauffer, TMRokosz, LLMcGuinness, BFHenderson, I Synthesis and SAR studies of trisubstituted purinones as potent and selective adenosine A2A receptor antagonists. Bioorg Med Chem Lett19:1399-402 (2009) 
 
Adenosine receptor A2a
Name:Adenosine receptor A2a
Type:G Protein-Coupled Receptor (GPCR)
Mol. Mass.:44716.46
Organism:Homo sapiens (Human)
Description:P29274
Residue:412
BDBM50247933
NameBDBM50247933
Synonyms:7-(2,6-difluorobenzyl)-2-(2-(dimethylamino)ethylamino)-9-(3-methoxyphenyl)-7H-purin-8(9H)-one | CHEMBL491285
TypeSmall organic molecule
Emp. Form.C23H24F2N6O2
Mol. Mass.454.4725
SMILESCOc1cccc(c1)-n1c2nc(NCCN(C)C)ncc2n(Cc2c(F)cccc2F)c1=O