Reaction Details
TargetAdenosine receptor A1
LigandBDBM50248379
Substrate/Competitorn/a
Meas. Tech.ChEMBL_543475 (CHEMBL1018641)
Ki 564±n/a nM
Citation Shao, YCole, AGBrescia, MRQin, LYDuo, JStauffer, TMRokosz, LLMcGuinness, BFHenderson, I Synthesis and SAR studies of trisubstituted purinones as potent and selective adenosine A2A receptor antagonists. Bioorg Med Chem Lett19:1399-402 (2009) 
 
Adenosine receptor A1
Name:Adenosine receptor A1
Type:G Protein-Coupled Receptor (GPCR)
Mol. Mass.:36520.92
Organism:Homo sapiens (Human)
Description:P30542
Residue:326
BDBM50248379
NameBDBM50248379
Synonyms:7-benzyl-2-(cyclopropylamino)-9-(3-methoxyphenyl)-7H-purin-8(9H)-one | CHEMBL490723
TypeSmall organic molecule
Emp. Form.C22H21N5O2
Mol. Mass.387.4344
SMILESCOc1cccc(c1)-n1c2nc(NC3CC3)ncc2n(Cc2ccccc2)c1=O