Reaction Details
TargetAdenosine receptor A1
LigandBDBM50248434
Substrate/Competitorn/a
Meas. Tech.ChEMBL_543475 (CHEMBL1018641)
Ki 330±n/a nM
Citation Shao, YCole, AGBrescia, MRQin, LYDuo, JStauffer, TMRokosz, LLMcGuinness, BFHenderson, I Synthesis and SAR studies of trisubstituted purinones as potent and selective adenosine A2A receptor antagonists. Bioorg Med Chem Lett19:1399-402 (2009) 
 
Adenosine receptor A1
Name:Adenosine receptor A1
Type:G Protein-Coupled Receptor (GPCR)
Mol. Mass.:36520.92
Organism:Homo sapiens (Human)
Description:P30542
Residue:326
BDBM50248434
NameBDBM50248434
Synonyms:2-(cyclopropylamino)-7-(2-fluoro-6-methoxybenzyl)-9-(3-methoxyphenyl)-7H-purin-8(9H)-one | CHEMBL489321
TypeSmall organic molecule
Emp. Form.C23H22FN5O3
Mol. Mass.435.4509
SMILESCOc1cccc(c1)-n1c2nc(NC3CC3)ncc2n(Cc2c(F)cccc2OC)c1=O