Reaction Details
TargetAdenosine receptor A1
LigandBDBM50248575
Substrate/Competitorn/a
Meas. Tech.ChEMBL_543475 (CHEMBL1018641)
Ki 1211±n/a nM
Citation Shao, YCole, AGBrescia, MRQin, LYDuo, JStauffer, TMRokosz, LLMcGuinness, BFHenderson, I Synthesis and SAR studies of trisubstituted purinones as potent and selective adenosine A2A receptor antagonists. Bioorg Med Chem Lett19:1399-402 (2009) 
 
Adenosine receptor A1
Name:Adenosine receptor A1
Type:G Protein-Coupled Receptor (GPCR)
Mol. Mass.:36520.92
Organism:Homo sapiens (Human)
Description:P30542
Residue:326
BDBM50248575
NameBDBM50248575
Synonyms:7-(2,6-difluorobenzyl)-9-(3-methoxyphenyl)-2-(pyridin-2-ylmethylamino)-7H-purin-8(9H)-one | CHEMBL464928
TypeSmall organic molecule
Emp. Form.C25H20F2N6O2
Mol. Mass.474.4621
SMILESCOc1cccc(c1)-n1c2nc(NCc3ccccn3)ncc2n(Cc2c(F)cccc2F)c1=O