Reaction Details
TargetPotassium voltage-gated channel subfamily KQT member 1
LigandBDBM50279700
Substrate/Competitorn/a
Meas. Tech.ChEMBL_545265 (CHEMBL1020711)
IC50 650±n/a nM
Citation Du, LLi, MYang, QTang, YYou, QXia, L Molecular hybridization, synthesis, and biological evaluation of novel chroman I(Kr) and I(Ks) dual blockers. Bioorg Med Chem Lett19:1477-80 (2009) 
 
Potassium voltage-gated channel subfamily KQT member 1
Name:Potassium voltage-gated channel subfamily KQT member 1
Type:PROTEIN
Mol. Mass.:74450.11
Organism:Cavia porcellus
Description:ChEMBL_88894
Residue:671
BDBM50279700
NameBDBM50279700
Synonyms:1-(2,3-dihydro-6-methoxychromen-4-ylideneamino)-3-(4-(4-methylpiperazin-1-yl)butyl)imidazolidine-2,4-dione | CHEMBL475109
TypeSmall organic molecule
Emp. Form.C22H31N5O4
Mol. Mass.429.5126
SMILESCOc1ccc2OCCC(=Nn3cc(O)n(CCCCN4CCN(C)CC4)c3=O)c2c1