Reaction Details
TargetPotassium voltage-gated channel subfamily KQT member 1
LigandBDBM50279455
Substrate/Competitorn/a
Meas. Tech.ChEMBL_545265 (CHEMBL1020711)
IC50 1230±n/a nM
Citation Du, LLi, MYang, QTang, YYou, QXia, L Molecular hybridization, synthesis, and biological evaluation of novel chroman I(Kr) and I(Ks) dual blockers. Bioorg Med Chem Lett19:1477-80 (2009) 
 
Potassium voltage-gated channel subfamily KQT member 1
Name:Potassium voltage-gated channel subfamily KQT member 1
Type:PROTEIN
Mol. Mass.:74450.11
Organism:Cavia porcellus
Description:ChEMBL_88894
Residue:671
BDBM50279455
NameBDBM50279455
Synonyms:1-(6-butoxy-2,3-dihydrochromen-4-ylideneamino)-3-(3-(4-methylpiperazin-1-yl)propyl)imidazolidine-2,4-dione | CHEMBL486321
TypeSmall organic molecule
Emp. Form.C24H35N5O4
Mol. Mass.457.5658
SMILESCCCCOc1ccc2OCCC(=Nn3cc(O)n(CCCN4CCN(C)CC4)c3=O)c2c1