Reaction Details
TargetPotassium voltage-gated channel subfamily KQT member 1
LigandBDBM50279435
Substrate/Competitorn/a
Meas. Tech.ChEMBL_545265 (CHEMBL1020711)
IC50 18900±n/a nM
Citation Du, LLi, MYang, QTang, YYou, QXia, L Molecular hybridization, synthesis, and biological evaluation of novel chroman I(Kr) and I(Ks) dual blockers. Bioorg Med Chem Lett19:1477-80 (2009) 
 
Potassium voltage-gated channel subfamily KQT member 1
Name:Potassium voltage-gated channel subfamily KQT member 1
Type:PROTEIN
Mol. Mass.:74450.11
Organism:Cavia porcellus
Description:ChEMBL_88894
Residue:671
BDBM50279435
NameBDBM50279435
Synonyms:1-(2,3-dihydro-6-methylchromen-4-ylideneamino)-3-(4-(piperidin-1-yl)butyl)imidazolidine-2,4-dione | CHEMBL488159
TypeSmall organic molecule
Emp. Form.C22H30N4O3
Mol. Mass.398.4986
SMILESCc1ccc2OCCC(=Nn3cc(O)n(CCCCN4CCCCC4)c3=O)c2c1