Reaction Details
TargetMelatonin receptor type 1B
LigandBDBM50240952
Substrate/Competitorn/a
Meas. Tech.ChEMBL_517311 (CHEMBL1031364)
Ki 0.16±n/a nM
Citation Zlotos, DPAttia, MIJulius, JSethi, SWitt-Enderby, PA 2-[(2,3-dihydro-1H-indol-1-yl)methyl]melatonin analogues: a novel class of MT2-selective melatonin receptor antagonists. J Med Chem52:826-33 (2009) 
 
Melatonin receptor type 1B
Name:Melatonin receptor type 1B
Type:Enzyme
Mol. Mass.:40203.54
Organism:Homo sapiens (Human)
Description:P49286
Residue:362
BDBM50240952
NameBDBM50240952
Synonyms:(4-Methoxy-6,7-dihydro-5H-dibenzo[a,c]cyclohepten-6-ylmethyl)-methoxymethyl-amine N-(8-Methoxy-10,11-dihydro-5H-dibenzo[a,d]cyclohepten-10-ylmethyl)-propionamide | UCM-454
TypeSmall organic molecule
Emp. Form.C20H23NO2
Mol. Mass.309.4021
SMILESCCC(=O)NCC1Cc2ccccc2Cc2ccc(OC)cc12