Reaction Details
TargetC-X-C chemokine receptor type 2
LigandBDBM50248279
Substrate/Competitorn/a
Meas. Tech.ChEMBL_566224 (CHEMBL963305)
Ki 2±n/a nM
Citation Biju, PTaveras, AGDwyer, MPYu, YChao, JHipkin, RWFan, XRindgen, DFine, JLundell, D Fluoroalkyl alpha side chain containing 3,4-diamino-cyclobutenediones as potent and orally bioavailable CXCR2-CXCR1 dual antagonists. Bioorg Med Chem Lett19:1431-3 (2009) 
 
C-X-C chemokine receptor type 2
Name:C-X-C chemokine receptor type 2
Type:Protein
Mol. Mass.:40767.88
Organism:Homo sapiens (Human)
Description:P25025
Residue:360
BDBM50248279
NameBDBM50248279
Synonyms:(S)-3-(3,4-dioxo-2-(2,2,2-trifluoro-1-(furan-2-yl)ethylamino)cyclobut-1-enylamino)-2-hydroxy-N,N-dimethylbenzamide | CHEMBL473959
TypeSmall organic molecule
Emp. Form.C19H16F3N3O5
Mol. Mass.423.3426
SMILESCN(C)C(=O)c1cccc(Nc2c(N[C@@H](c3ccco3)C(F)(F)F)c(=O)c2=O)c1O